Target
Glycogen phosphorylase, muscle form
Ligand
BDBM50135554
Substrate
Meas. Tech.
ChEBML_70984
IC50
3±n/a nM
Citation
 Lu, ZBohn, JBergeron, RDeng, QEllsworth, KPGeissler, WMHarris, GMcCann, PEMcKeever, BMyers, RWSaperstein, RWilloughby, CAYao, JChapman, K A new class of glycogen phosphorylase inhibitors. Bioorg Med Chem Lett 13:4125-8 (2003)  
Target
Name:
Glycogen phosphorylase, muscle form
Synonyms:
Glycogen phosphorylase, muscle form Myophosphorylase PYGM_HUMAN
Type:
PROTEIN
Mol. Mass.:
97097.45
Organism:
Homo sapiens (Human)
Description:
ChEMBL_1449751
Residue:
842
  
Inhibitor
Name:
BDBM50135554
Synonyms:
4-{3-[(4-Nitro-pyridine-2-carbonyl)-amino]-naphthalen-2-yloxy}-phthalic acid | CHEMBL134802
Type:
Small organic molecule
Emp. Form.:
C24H15N3O8
Mol. Mass.:
473.3912
SMILES:
OC(=O)c1ccc(Oc2cc3ccccc3cc2NC(=O)c2cc(ccn2)[N+]([O-])=O)cc1C(O)=O
: