Target
Calcitonin gene-related peptide 2
Ligand
BDBM50570391
Substrate
Meas. Tech.
ChEMBL_2112109 (CHEMBL4820959)
IC50
3162±n/a nM
Citation
 Zirimwabagabo, JOJailani, ABAAvgoustou, PTozer, MJGibson, KRGlossop, PAMills, JEJPorter, RABlaney, PWang, NSkerry, TMRichards, GOHarrity, JPA Discovery of a First-In-Class Small Molecule Antagonist against the Adrenomedullin-2 Receptor: Structure-Activity Relationships and Optimization. J Med Chem 64:3299-3319 (2021)  
Target
Name:
Calcitonin gene-related peptide 2
Synonyms:
Beta-CGRP CALC2 CALCB_HUMAN Calcitonin gene-related peptide II
Type:
PROTEIN
Mol. Mass.:
13714.13
Organism:
Homo sapiens
Description:
ChEMBL_116903
Residue:
127
  
Inhibitor
Name:
BDBM50570391
Synonyms:
CHEMBL4876213
Type:
Small organic molecule
Emp. Form.:
C29H37N5O3
Mol. Mass.:
503.6358
SMILES:
CN1CCCC(CN(CC(=O)Nc2ccc3CC4(Cc3c2)C(=O)Nc2ncccc42)C(=O)C(C)(C)C)C1
: