Target
Calcitonin gene-related peptide 2
Ligand
BDBM50570409
Substrate
Meas. Tech.
ChEMBL_2112109 (CHEMBL4820959)
IC50
4.0±n/a nM
Citation
 Zirimwabagabo, JOJailani, ABAAvgoustou, PTozer, MJGibson, KRGlossop, PAMills, JEJPorter, RABlaney, PWang, NSkerry, TMRichards, GOHarrity, JPA Discovery of a First-In-Class Small Molecule Antagonist against the Adrenomedullin-2 Receptor: Structure-Activity Relationships and Optimization. J Med Chem 64:3299-3319 (2021)  
Target
Name:
Calcitonin gene-related peptide 2
Synonyms:
Beta-CGRP CALC2 CALCB_HUMAN Calcitonin gene-related peptide II
Type:
PROTEIN
Mol. Mass.:
13714.13
Organism:
Homo sapiens
Description:
ChEMBL_116903
Residue:
127
  
Inhibitor
Name:
BDBM50570409
Synonyms:
CHEMBL4857810
Type:
Small organic molecule
Emp. Form.:
C31H35N5O3
Mol. Mass.:
525.6413
SMILES:
CNCc1ccccc1CN(CC(=O)Nc1ccc2CC3(Cc2c1)C(=O)Nc1ncccc31)C(=O)C(C)(C)C
: