Target
Calcitonin gene-related peptide 2
Ligand
BDBM50570410
Substrate
Meas. Tech.
ChEMBL_2112109 (CHEMBL4820959)
IC50
1.000000±n/a nM
Citation
 Zirimwabagabo, JOJailani, ABAAvgoustou, PTozer, MJGibson, KRGlossop, PAMills, JEJPorter, RABlaney, PWang, NSkerry, TMRichards, GOHarrity, JPA Discovery of a First-In-Class Small Molecule Antagonist against the Adrenomedullin-2 Receptor: Structure-Activity Relationships and Optimization. J Med Chem 64:3299-3319 (2021)  
Target
Name:
Calcitonin gene-related peptide 2
Synonyms:
Beta-CGRP CALC2 CALCB_HUMAN Calcitonin gene-related peptide II
Type:
PROTEIN
Mol. Mass.:
13714.13
Organism:
Homo sapiens
Description:
ChEMBL_116903
Residue:
127
  
Inhibitor
Name:
BDBM50570410
Synonyms:
CHEMBL4851152
Type:
Small organic molecule
Emp. Form.:
C33H37N5O3
Mol. Mass.:
551.6786
SMILES:
CC(C)(C)C(=O)N(CC(=O)Nc1ccc2CC3(Cc2c1)C(=O)Nc1ncccc31)Cc1ccccc1CNC1CC1
: