Target
Phospho-N-acetylmuramoyl-pentapeptide-transferase
Ligand
BDBM50221464
Substrate
Meas. Tech.
ChEMBL_208264 (CHEMBL813224)
IC50
208±n/a nM
Citation
 Hotoda, HFurukawa, MDaigo, MMurayama, KKaneko, MMuramatsu, YIshii, MMMiyakoshi, STakatsu, TInukai, MKakuta, MAbe, THarasaki, TFukuoka, TUtsui, YOhya, S Synthesis and antimycobacterial activity of capuramycin analogues. Part 1: substitution of the azepan-2-one moiety of capuramycin. Bioorg Med Chem Lett 13:2829-32 (2003)  
Target
Name:
Phospho-N-acetylmuramoyl-pentapeptide-transferase
Synonyms:
MRAY_ECOLI mraY | murX
Type:
PROTEIN
Mol. Mass.:
39889.38
Organism:
Escherichia coli (strain K12)
Description:
ChEMBL_1454117
Residue:
360
  
Inhibitor
Name:
BDBM50221464
Synonyms:
CHEMBL97100
Type:
Small organic molecule
Emp. Form.:
C26H32N4O11
Mol. Mass.:
576.5525
SMILES:
[H][C@@]1(O[C@H]([C@H](O)[C@@H]1OC)n1ccc(=O)[nH]c1=O)[C@@H](O[C@H]1OC(=C[C@H](O)[C@@H]1O)C(=O)Nc1ccc(cc1)C(C)C)C(N)=O
: