Target
60 kDa heat shock protein, mitochondrial
Ligand
BDBM50468057
Substrate
Meas. Tech.
ChEMBL_2114004 (CHEMBL4822854)
IC50
>100000±n/a nM
Citation
 Ray, AMSalim, NStevens, MChitre, SAbdeen, SWashburn, ASivinski, JO'Hagan, HMChapman, EJohnson, SM Exploiting the HSP60/10 chaperonin system as a chemotherapeutic target for colorectal cancer. Bioorg Med Chem 40:0 (2021)  
Target
Name:
60 kDa heat shock protein, mitochondrial
Synonyms:
3.6.4.9 60 kDa heat shock protein, mitochondrial CPN60 HSP-60 HSP60/HSP10 Heat shock protein 60 Mitochondrial matrix protein P1 | P60 lymphocyte protein
Type:
PROTEIN
Mol. Mass.:
61050.41
Organism:
Homo sapiens
Description:
ChEMBL_117701
Residue:
573
  
Inhibitor
Name:
BDBM50468057
Synonyms:
CHEMBL4281358
Type:
Small organic molecule
Emp. Form.:
C20H13BrN2O2S2
Mol. Mass.:
457.363
SMILES:
Oc1c(Br)cccc1C(=O)Nc1ccc(Sc2nc3ccccc3s2)cc1
: