Target
Thiosulfate sulfurtransferase
Ligand
BDBM50450001
Substrate
Meas. Tech.
ChEMBL_2114020 (CHEMBL4822870)
IC50
>100000±n/a nM
Citation
 Ray, AMSalim, NStevens, MChitre, SAbdeen, SWashburn, ASivinski, JO'Hagan, HMChapman, EJohnson, SM Exploiting the HSP60/10 chaperonin system as a chemotherapeutic target for colorectal cancer. Bioorg Med Chem 40:0 (2021)  
Target
Name:
Thiosulfate sulfurtransferase
Synonyms:
2.8.1.1 THTR_HUMAN Thiosulfate sulfurtransferase
Type:
PROTEIN
Mol. Mass.:
33432.06
Organism:
Homo sapiens
Description:
ChEMBL_118080
Residue:
297
  
Inhibitor
Name:
BDBM50450001
Synonyms:
CHEMBL4162794
Type:
Small organic molecule
Emp. Form.:
C21H13Cl2N3O5S4
Mol. Mass.:
586.511
SMILES:
Clc1ccc(s1)S(=O)(=O)Nc1ccc(cc1)-c1nc2cc(NS(=O)(=O)c3ccc(Cl)s3)ccc2o1
: