Target
Thiosulfate sulfurtransferase
Ligand
BDBM50468057
Substrate
Meas. Tech.
ChEMBL_2114020 (CHEMBL4822870)
IC50
>100000±n/a nM
Citation
 Ray, AMSalim, NStevens, MChitre, SAbdeen, SWashburn, ASivinski, JO'Hagan, HMChapman, EJohnson, SM Exploiting the HSP60/10 chaperonin system as a chemotherapeutic target for colorectal cancer. Bioorg Med Chem 40:0 (2021)  
Target
Name:
Thiosulfate sulfurtransferase
Synonyms:
2.8.1.1 THTR_HUMAN Thiosulfate sulfurtransferase
Type:
PROTEIN
Mol. Mass.:
33432.06
Organism:
Homo sapiens
Description:
ChEMBL_118080
Residue:
297
  
Inhibitor
Name:
BDBM50468057
Synonyms:
CHEMBL4281358
Type:
Small organic molecule
Emp. Form.:
C20H13BrN2O2S2
Mol. Mass.:
457.363
SMILES:
Oc1c(Br)cccc1C(=O)Nc1ccc(Sc2nc3ccccc3s2)cc1
: