Target
Melatonin receptor type 1A
Ligand
BDBM50136409
Substrate
Meas. Tech.
ChEBML_105102
Ki
0.650000±n/a nM
Citation
 Sun, LQChen, JMattson, RJEpperson, JRDeskus, JALi, WSTakaki, KHodges, DBIben, LMahle, CDOrtiz, AMolstad, DRyan, EYeleswaram, KXu, CLuo, G Heterocyclic aminopyrrolidine derivatives as melatoninergic agents. Bioorg Med Chem Lett 13:4381-4 (2003)  
Target
Name:
Melatonin receptor type 1A
Synonyms:
MTNR1A MTR1A_HUMAN Mel1a melatonin receptor Melatonin receptor Melatonin receptor type 1 (MT1) | Melatonin receptor type 1A
Type:
Enzyme
Mol. Mass.:
39392.94
Organism:
Homo sapiens (Human)
Description:
P48039
Residue:
350
  
Inhibitor
Name:
BDBM50136409
Synonyms:
1-[(R)-1-(2,3-Dihydro-benzofuran-4-yl)-pyrrolidin-3-yl]-3-ethyl-urea | CHEMBL136564
Type:
Small organic molecule
Emp. Form.:
C15H21N3O2
Mol. Mass.:
275.3461
SMILES:
CCNC(=O)N[C@@H]1CCN(C1)c1cccc2OCCc12
: