Target
Glycogen phosphorylase, muscle form
Ligand
BDBM50136430
Substrate
Meas. Tech.
ChEBML_70995
IC50
83±n/a nM
Citation
 Rosauer, KGOgawa, AKWilloughby, CAEllsworth, KPGeissler, WMMyers, RWDeng, QChapman, KTHarris, GMoller, DE Novel 3,4-dihydroquinolin-2(1H)-one inhibitors of human glycogen phosphorylase a. Bioorg Med Chem Lett 13:4385-8 (2003)  
Target
Name:
Glycogen phosphorylase, muscle form
Synonyms:
Glycogen phosphorylase, muscle form Myophosphorylase PYGM_HUMAN
Type:
PROTEIN
Mol. Mass.:
97097.45
Organism:
Homo sapiens (Human)
Description:
ChEMBL_1449751
Residue:
842
  
Inhibitor
Name:
BDBM50136430
Synonyms:
5-Chloro-1H-indole-2-carboxylic acid ((R)-2-oxo-2,3,4,5-tetrahydro-1H-benzo[b]azepin-3-yl)-amide | CHEMBL134797
Type:
Small organic molecule
Emp. Form.:
C19H16ClN3O2
Mol. Mass.:
353.802
SMILES:
Clc1ccc2[nH]c(cc2c1)C(=O)N[C@@H]1CCc2ccccc2NC1=O
: