Target
Glycogen phosphorylase, muscle form
Ligand
BDBM50136444
Substrate
Meas. Tech.
ChEBML_70995
IC50
105±n/a nM
Citation
 Rosauer, KGOgawa, AKWilloughby, CAEllsworth, KPGeissler, WMMyers, RWDeng, QChapman, KTHarris, GMoller, DE Novel 3,4-dihydroquinolin-2(1H)-one inhibitors of human glycogen phosphorylase a. Bioorg Med Chem Lett 13:4385-8 (2003)  
Target
Name:
Glycogen phosphorylase, muscle form
Synonyms:
Glycogen phosphorylase, muscle form Myophosphorylase PYGM_HUMAN
Type:
PROTEIN
Mol. Mass.:
97097.45
Organism:
Homo sapiens (Human)
Description:
ChEMBL_1449751
Residue:
842
  
Inhibitor
Name:
BDBM50136444
Synonyms:
5-Chloro-1H-indole-2-carboxylic acid (1-methyl-2-oxo-2,3,4,5-tetrahydro-1H-benzo[b]azepin-3-yl)-amide | CHEMBL342364
Type:
Small organic molecule
Emp. Form.:
C20H18ClN3O2
Mol. Mass.:
367.829
SMILES:
CN1c2ccccc2CCC(NC(=O)c2cc3cc(Cl)ccc3[nH]2)C1=O
: