Target
Glycogen phosphorylase, muscle form
Ligand
BDBM50136416
Substrate
Meas. Tech.
ChEBML_70995
IC50
69±n/a nM
Citation
 Rosauer, KGOgawa, AKWilloughby, CAEllsworth, KPGeissler, WMMyers, RWDeng, QChapman, KTHarris, GMoller, DE Novel 3,4-dihydroquinolin-2(1H)-one inhibitors of human glycogen phosphorylase a. Bioorg Med Chem Lett 13:4385-8 (2003)  
Target
Name:
Glycogen phosphorylase, muscle form
Synonyms:
Glycogen phosphorylase, muscle form Myophosphorylase PYGM_HUMAN
Type:
PROTEIN
Mol. Mass.:
97097.45
Organism:
Homo sapiens (Human)
Description:
ChEMBL_1449751
Residue:
842
  
Inhibitor
Name:
BDBM50136416
Synonyms:
6-Chloro-1H-indole-2-carboxylic acid (1-methyl-2-oxo-1,2,3,4-tetrahydro-quinolin-3-yl)-amide | CHEMBL422632
Type:
Small organic molecule
Emp. Form.:
C19H16ClN3O2
Mol. Mass.:
353.802
SMILES:
CN1C(=O)C(Cc2ccccc12)NC(=O)c1cc2ccc(Cl)cc2[nH]1
: