Target
5-hydroxytryptamine receptor 1D
Ligand
BDBM50136468
Substrate
Meas. Tech.
ChEBML_1724
Ki
7.3±n/a nM
Citation
 Isaac, MSlassi, MXin, TArora, JO'Brien, AEdwards, LMacLean, NWilson, JDemschyshyn, LLabrie, PNaismith, AMaddaford, SPapac, DHarrison, SWang, HDraper, STehim, A Design, synthesis and biological activity of novel dimethyl-[2-[6-substituted-indol-1-yl]-ethyl]-amine as potent, selective, and orally-bioavailable 5-HT(1D) agonists. Bioorg Med Chem Lett 13:4409-13 (2003)  
Target
Name:
5-hydroxytryptamine receptor 1D
Synonyms:
5-HT-1D 5-HT1D 5HT1D_HUMAN HTR1DA Serotonin (5-HT) receptor | Serotonin Receptor 1D
Type:
G Protein-Coupled Receptor (GPCR)
Mol. Mass.:
41920.63
Organism:
Homo sapiens (Human)
Description:
Receptor binding assays were performed using human clone stably expressed in CHO cells.
Residue:
377
  
Inhibitor
Name:
BDBM50136468
Synonyms:
CHEMBL138821 | Dimethyl-[2-(6-thiophen-3-yl-indol-1-yl)-ethyl]-amine
Type:
Small organic molecule
Emp. Form.:
C16H18N2S
Mol. Mass.:
270.393
SMILES:
CN(C)CCn1ccc2ccc(cc12)-c1ccsc1
: