Target
Serine-protein kinase ATM
Ligand
BDBM50571452
Substrate
Meas. Tech.
ChEMBL_2114758 (CHEMBL4823699)
Ki
25±n/a nM
Citation
 Van de Poël, AToledo-Sherman, LBreccia, PCachope, RBate, JRAngulo-Herrera, IWishart, GMatthews, KLMartin, SLPeacock, MBarnard, ACox, HCJones, GMcAllister, GVater, HEsmieu, WClissold, CLamers, MLeonard, PJarvis, REBlackaby, WEznarriaga, MLazari, OYates, DRose, MJang, SWMuñoz-Sanjuan, IDominguez, C Structure-Based Exploration of Selectivity for ATM Inhibitors in Huntington's Disease. J Med Chem 64:5018-5036 (2021)  
Target
Name:
Serine-protein kinase ATM
Synonyms:
A-T mutated ATM_HUMAN | Ataxia telangiectasia mutated
Type:
Protein
Mol. Mass.:
350696.72
Organism:
Homo sapiens (Human)
Description:
Q13315
Residue:
3056
  
Inhibitor
Name:
BDBM50571452
Synonyms:
CHEMBL4874992
Type:
Small organic molecule
Emp. Form.:
C22H21N3O3S
Mol. Mass.:
407.485
SMILES:
COc1ccc2Sc3c(Cc2c1)cccc3-c1cc(O)nc(n1)N1CCOCC1
: