Target
Serine-protein kinase ATM
Ligand
BDBM50571464
Substrate
Meas. Tech.
ChEMBL_2114758 (CHEMBL4823699)
Ki
2.0±n/a nM
Citation
 Van de Poël, AToledo-Sherman, LBreccia, PCachope, RBate, JRAngulo-Herrera, IWishart, GMatthews, KLMartin, SLPeacock, MBarnard, ACox, HCJones, GMcAllister, GVater, HEsmieu, WClissold, CLamers, MLeonard, PJarvis, REBlackaby, WEznarriaga, MLazari, OYates, DRose, MJang, SWMuñoz-Sanjuan, IDominguez, C Structure-Based Exploration of Selectivity for ATM Inhibitors in Huntington's Disease. J Med Chem 64:5018-5036 (2021)  
Target
Name:
Serine-protein kinase ATM
Synonyms:
A-T mutated ATM_HUMAN | Ataxia telangiectasia mutated
Type:
Protein
Mol. Mass.:
350696.72
Organism:
Homo sapiens (Human)
Description:
Q13315
Residue:
3056
  
Inhibitor
Name:
BDBM50571464
Synonyms:
CHEMBL4874640 | US11685734, Example 43
Type:
Small organic molecule
Emp. Form.:
C21H25N3O2
Mol. Mass.:
351.4421
SMILES:
[H][C@]12C[C@@]1([H])[C@H](Cc1ccccc1)N(C2)c1cc(cc(=O)[nH]1)N1CCOCC1
: