Target
Serine-protein kinase ATM
Ligand
BDBM50571469
Substrate
Meas. Tech.
ChEMBL_2114758 (CHEMBL4823699)
Ki
1.000000±n/a nM
Citation
 Van de Poël, AToledo-Sherman, LBreccia, PCachope, RBate, JRAngulo-Herrera, IWishart, GMatthews, KLMartin, SLPeacock, MBarnard, ACox, HCJones, GMcAllister, GVater, HEsmieu, WClissold, CLamers, MLeonard, PJarvis, REBlackaby, WEznarriaga, MLazari, OYates, DRose, MJang, SWMuñoz-Sanjuan, IDominguez, C Structure-Based Exploration of Selectivity for ATM Inhibitors in Huntington's Disease. J Med Chem 64:5018-5036 (2021)  
Target
Name:
Serine-protein kinase ATM
Synonyms:
A-T mutated ATM_HUMAN | Ataxia telangiectasia mutated
Type:
Protein
Mol. Mass.:
350696.72
Organism:
Homo sapiens (Human)
Description:
Q13315
Residue:
3056
  
Inhibitor
Name:
BDBM50571469
Synonyms:
CHEMBL4852763 | US11685734, Example 270
Type:
Small organic molecule
Emp. Form.:
C22H30N4O2
Mol. Mass.:
382.4992
SMILES:
C[C@@H]1CN(CCO1)c1cc(=O)[nH]c(n1)N1CCCCC[C@@H]1Cc1ccccc1
: