Target
Phosphatidylinositol 3-kinase catalytic subunit type 3
Ligand
BDBM50571463
Substrate
Meas. Tech.
ChEMBL_2114760 (CHEMBL4823701)
Ki
4.0±n/a nM
Citation
 Van de Poël, AToledo-Sherman, LBreccia, PCachope, RBate, JRAngulo-Herrera, IWishart, GMatthews, KLMartin, SLPeacock, MBarnard, ACox, HCJones, GMcAllister, GVater, HEsmieu, WClissold, CLamers, MLeonard, PJarvis, REBlackaby, WEznarriaga, MLazari, OYates, DRose, MJang, SWMuñoz-Sanjuan, IDominguez, C Structure-Based Exploration of Selectivity for ATM Inhibitors in Huntington's Disease. J Med Chem 64:5018-5036 (2021)  
Target
Name:
Phosphatidylinositol 3-kinase catalytic subunit type 3
Synonyms:
BC033004 PIK3C3 Phosphatidylinositol 3-kinase catalytic subunit type 3 (PIK3C3) Phosphoinositide 3-Kinase (PI3K), Vps34 PtdIns-3-kinase type 3 hVPS34
Type:
Enzyme
Mol. Mass.:
101551.30
Organism:
Homo sapiens (Human)
Description:
Recombinant human Vps34 protein was expressed as monomeric GST-fusion and purified.
Residue:
887
  
Inhibitor
Name:
BDBM50571463
Synonyms:
CHEMBL4862803
Type:
Small organic molecule
Emp. Form.:
C21H25N3O2
Mol. Mass.:
351.4421
SMILES:
[H][C@@]12C[C@]1([H])[C@H](Cc1ccccc1)N(C2)c1cc(cc(=O)[nH]1)N1CCOCC1
: