Target
Lysine--tRNA ligase
Ligand
BDBM50571530
Substrate
Meas. Tech.
ChEMBL_2115022 (CHEMBL4823963)
Kd
5750±n/a nM
Citation
 Lee, SKwon, NHSeo, BLee, JYCho, HYKim, KKim, HSJung, KJeon, YHKim, SSuh, YG Discovery of novel potent migrastatic Thiazolo[5,4-b]pyridines targeting Lysyl-tRNA synthetase (KRS) for treatment of Cancer metastasis. Eur J Med Chem 218:0 (2021)  
Target
Name:
Lysine--tRNA ligase
Synonyms:
KARS KIAA0070 SYK_HUMAN
Type:
PROTEIN
Mol. Mass.:
68044.78
Organism:
Homo sapiens (Human)
Description:
ChEMBL_960665
Residue:
597
  
Inhibitor
Name:
BDBM50571530
Synonyms:
CHEMBL4852870
Type:
Small organic molecule
Emp. Form.:
C23H21N3O3S
Mol. Mass.:
419.496
SMILES:
COc1ccc(CCN(Cc2ccc(cc2)C(O)=O)c2nc3cccnc3s2)cc1
: