Target
Trypanothione reductase
Ligand
BDBM50571699
Substrate
Meas. Tech.
ChEMBL_2115316 (CHEMBL4824257)
Ki
1300±n/a nM
Citation
 Revuelto, Ade Lucio, HGarcía-Soriano, JCSánchez-Murcia, PAGago, FJiménez-Ruiz, ACamarasa, MJVelázquez, S Efficient Dimerization Disruption of  J Med Chem 64:6137-6160 (2021)  
Target
Name:
Trypanothione reductase
Synonyms:
Type:
PROTEIN
Mol. Mass.:
53023.27
Organism:
Leishmania infantum
Description:
ChEMBL_801918
Residue:
491
  
Inhibitor
Name:
BDBM50571699
Synonyms:
CHEMBL4855840
Type:
Small organic molecule
Emp. Form.:
C34H34F3N7O4S
Mol. Mass.:
693.738
SMILES:
OC(=O)C(F)(F)F.NCCCCc1cn(nn1)-c1ccc(-c2nc(c(s2)-c2ccccc2)-c2ccccc2)c(OCCN2CCNC2=O)c1
: