Target
Holo-[acyl-carrier-protein] synthase
Ligand
BDBM50137234
Substrate
Meas. Tech.
ChEBML_88040
IC50
1500±n/a nM
Citation
 Gilbert, AMKirisits, MToy, PNunn, DSFailli, ADushin, EGNovikova, EPetersen, PJJoseph-McCarthy, DMcFadyen, IFritz, CC Anthranilate 4H-oxazol-5-ones: novel small molecule antibacterial acyl carrier protein synthase (AcpS) inhibitors. Bioorg Med Chem Lett 14:37-41 (2003)  
Target
Name:
Holo-[acyl-carrier-protein] synthase
Synonyms:
ACPS_BACSU acpS | ydcB
Type:
PROTEIN
Mol. Mass.:
13724.66
Organism:
Bacillus subtilis
Description:
ChEMBL_326222
Residue:
121
  
Inhibitor
Name:
BDBM50137234
Synonyms:
5-Bromo-2-{[2-(3-fluoro-4-trifluoromethyl-phenyl)-5-oxo-oxazol-(4E)-ylidenemethyl]-amino}-benzoic acid | CHEMBL129980
Type:
Small organic molecule
Emp. Form.:
C18H9BrF4N2O4
Mol. Mass.:
473.173
SMILES:
OC(=O)c1cc(Br)ccc1\N=C\c1nc(oc1O)-c1ccc(c(F)c1)C(F)(F)F
: