Target
Heat shock protein HSP 90-alpha
Ligand
BDBM50180302
Substrate
Meas. Tech.
ChEMBL_2115999 (CHEMBL4824940)
IC50
73±n/a nM
Citation
 Yang, SYoon, NGKim, DPark, EKim, SYLee, JHLee, CKang, BHKang, S Design and Synthesis of TRAP1 Selective Inhibitors: H-Bonding with Asn171 Residue in TRAP1 Increases Paralog Selectivity. ACS Med Chem Lett 12:1173-1180 (2021)  
Target
Name:
Heat shock protein HSP 90-alpha
Synonyms:
HS90A_HUMAN HSP86 HSP90AA1 HSPCA Heat shock 86 kDa Heat shock protein HSP 90-alpha (HSP90) LAP-2 Lipopolysaccharide-associated protein 2 heat shock protein 90kDa alpha (cytosolic), class A member 1 isoform 2
Type:
Molecular Chaperone
Mol. Mass.:
84623.45
Organism:
Homo sapiens (Human)
Description:
P07900
Residue:
732
  
Inhibitor
Name:
BDBM50180302
Synonyms:
8-(6-iodo-benzo[1,3]dioxol-5-ylsulfanyl)-9-(3-isopropylamino-propyl)adenine 8-[(6-IODO-1,3-BENZODIOXOL-5-YL)THIO]-9-[3-(ISOPROPYLAMINO)PROPYL]-9H-PURIN-6-AMINE US10336757, Compound PU-H71 | US10676476, Example 9
Type:
Small organic molecule
Emp. Form.:
C18H21IN6O2S
Mol. Mass.:
512.368
SMILES:
CC(C)NCCCn1c(Sc2cc3OCOc3cc2I)nc2c(N)ncnc12
: