Target
Tyrosine-protein kinase receptor UFO
Ligand
BDBM50571949
Substrate
Meas. Tech.
ChEMBL_2116013 (CHEMBL4824954)
IC50
49±n/a nM
Citation
 Inoue, SYamane, YTsukamoto, SMurai, NAzuma, HNagao, SNishibata, KFukushima, SIchikawa, KNakagawa, THata Sugi, NIto, DKato, YGoto, AKakiuchi, DUeno, TMatsui, JMatsushima, T Discovery of 5,6,7,8-tetrahydropyrido[3,4-d]pyrimidine derivatives as novel selective Axl inhibitors. Bioorg Med Chem Lett 48:0 (2021)  
Target
Name:
Tyrosine-protein kinase receptor UFO
Synonyms:
2.7.10.1 Ark Tyrosine-protein kinase receptor UFO Ufo
Type:
PROTEIN
Mol. Mass.:
98177.22
Organism:
Mus musculus
Description:
ChEMBL_120415
Residue:
888
  
Inhibitor
Name:
BDBM50571949
Synonyms:
CHEMBL4874534
Type:
Small organic molecule
Emp. Form.:
C33H34F3N7O4
Mol. Mass.:
649.6628
SMILES:
CN1CCC(CN2CCc3c(C2)ncnc3Oc2ccc(NC(=O)c3cn(CCF)c(=O)n(-c4ccc(F)cc4)c3=O)cc2F)CC1
: