Target
M-phase inducer phosphatase 2
Ligand
BDBM50571956
Substrate
Meas. Tech.
ChEMBL_2116037 (CHEMBL4824978)
Ki
2600±n/a nM
Citation
 Nagaoka, YParvatkar, PHirai, GOhkanda, J Design, synthesis, and functional evaluation of triazine-based bivalent agents that simultaneously target the active site and hot spot of phosphatase Cdc25B. Bioorg Med Chem Lett 48:0 (2021)  
Target
Name:
M-phase inducer phosphatase 2
Synonyms:
CDC25B Dual specificity phosphatase (CDC25B) M-phase inducer phosphatase 2 (CDC25B) | MPIP2_HUMAN
Type:
Protein
Mol. Mass.:
64985.27
Organism:
Homo sapiens (Human)
Description:
Residue:
580
  
Inhibitor
Name:
BDBM50571956
Synonyms:
CHEMBL4874608
Type:
Small organic molecule
Emp. Form.:
C43H52N14O14
Mol. Mass.:
988.9584
SMILES:
OC(=O)C[C@H](Nc1nc(NCCCCCNC(=O)CCCNc2nc(N[C@@H](CC(O)=O)C(O)=O)nc(N[C@@H](Cc3ccc(O)cc3)C(O)=O)n2)nc(N[C@@H](Cc2c[nH]c3ccccc23)C(O)=O)n1)C(O)=O
: