Target
Phosphatidylinositol 4,5-bisphosphate 3-kinase catalytic subunit beta isoform
Ligand
BDBM50571986
Substrate
Meas. Tech.
ChEMBL_2116058 (CHEMBL4824999)
IC50
4.6±n/a nM
Citation
 Tian, CYang, CWu, TLu, MChen, YYang, YLiu, XLing, YDeng, MJia, YZhou, Y Discovery of cinnoline derivatives as potent PI3K inhibitors with antiproliferative activity. Bioorg Med Chem Lett 48:0 (2021)  
Target
Name:
Phosphatidylinositol 4,5-bisphosphate 3-kinase catalytic subunit beta isoform
Synonyms:
PI3-kinase p110 subunit beta PI3Kbeta PIK3CB Phosphatidylinositol 4,5-bisphosphate 3-kinase catalytic subunit beta (PI3Kbeta) Phosphatidylinositol 4,5-bisphosphate 3-kinase catalytic subunit beta isoform (PI3K) Phosphatidylinositol 4,5-bisphosphate 3-kinase catalytic subunit beta isoform (PI3Kbeta) Phosphatidylinositol-4,5-bisphosphate 3-kinase catalytic subunit beta isoform Phosphoinositide 3-Kinase (PI3K), beta Chain A PtdIns-3-kinase p110
Type:
Enzyme Subunit
Mol. Mass.:
122769.00
Organism:
Homo sapiens (Human)
Description:
P42338
Residue:
1070
  
Inhibitor
Name:
BDBM50571986
Synonyms:
CHEMBL4876806
Type:
Small organic molecule
Emp. Form.:
C24H22ClN5O2S
Mol. Mass.:
479.982
SMILES:
Clc1ncc(cc1NS(=O)(=O)c1ccccc1)-c1ccc2nncc(N3CCCCC3)c2c1
: