Target
D(2) dopamine receptor
Ligand
BDBM50572024
Substrate
Meas. Tech.
ChEMBL_2116072 (CHEMBL4825013)
Ki
744±n/a nM
Citation
 Cai, JHuang, MWang, YChen, XJi, M Design, synthesis and preliminary bioactivity evaluation of bitopic benzopyranomorpholine analogues as selective dopamine D3 receptor ligands as anti-drug addiction therapeutic agents. Bioorg Med Chem Lett 48:0 (2021)  
Target
Name:
D(2) dopamine receptor
Synonyms:
D(2) dopamine receptor DOPAMINE D2 Long DRD2 Dopamine D2 receptor Dopamine D2 receptor (D2R) Dopamine2-like | d2
Type:
Cell-surface receptors
Mol. Mass.:
50647.10
Organism:
Homo sapiens (Human)
Description:
P14416
Residue:
443
  
Inhibitor
Name:
BDBM50572024
Synonyms:
CHEMBL4862790
Type:
Small organic molecule
Emp. Form.:
C22H27N3O4
Mol. Mass.:
397.4675
SMILES:
[H][C@@]12COc3ccc(OC)cc3[C@@]1([H])OCCN2CCCCNC(=O)c1cccnc1
: