Target
D(3) dopamine receptor
Ligand
BDBM50572003
Substrate
Meas. Tech.
ChEMBL_2116073 (CHEMBL4825014)
Ki
44±n/a nM
Citation
 Cai, JHuang, MWang, YChen, XJi, M Design, synthesis and preliminary bioactivity evaluation of bitopic benzopyranomorpholine analogues as selective dopamine D3 receptor ligands as anti-drug addiction therapeutic agents. Bioorg Med Chem Lett 48:0 (2021)  
Target
Name:
D(3) dopamine receptor
Synonyms:
DRD3 Dopamine D3 receptor
Type:
PROTEIN
Mol. Mass.:
44213.40
Organism:
Homo sapiens
Description:
ChEMBL_105671
Residue:
400
  
Inhibitor
Name:
BDBM50572003
Synonyms:
CHEMBL4854126
Type:
Small organic molecule
Emp. Form.:
C28H30N2O3
Mol. Mass.:
442.5494
SMILES:
[H][C@@]12COc3ccccc3[C@@]1([H])OCCN2CCCCNC(=O)c1ccc(cc1)-c1ccccc1
: