Target
D(3) dopamine receptor
Ligand
BDBM50119380
Substrate
Meas. Tech.
ChEMBL_2116073 (CHEMBL4825014)
Ki
1.3±n/a nM
Citation
 Cai, JHuang, MWang, YChen, XJi, M Design, synthesis and preliminary bioactivity evaluation of bitopic benzopyranomorpholine analogues as selective dopamine D3 receptor ligands as anti-drug addiction therapeutic agents. Bioorg Med Chem Lett 48:0 (2021)  
Target
Name:
D(3) dopamine receptor
Synonyms:
DRD3 Dopamine D3 receptor
Type:
PROTEIN
Mol. Mass.:
44213.40
Organism:
Homo sapiens
Description:
ChEMBL_105671
Residue:
400
  
Inhibitor
Name:
BDBM50119380
Synonyms:
CHEMBL25236 N-(4-(4-(2-methoxyphenyl)piperazin-1-yl)butyl)-2-naphthamide | Naphthalene-2-carboxylic acid {4-[4-(2-methoxy-phenyl)-piperazin-1-yl]-butyl}-amide
Type:
Small organic molecule
Emp. Form.:
C26H31N3O2
Mol. Mass.:
417.5432
SMILES:
COc1ccccc1N1CCN(CCCCNC(=O)c2ccc3ccccc3c2)CC1
: