Target
D(3) dopamine receptor
Ligand
BDBM50010586
Substrate
Meas. Tech.
ChEMBL_2116073 (CHEMBL4825014)
Ki
1.8±n/a nM
Citation
 Cai, JHuang, MWang, YChen, XJi, M Design, synthesis and preliminary bioactivity evaluation of bitopic benzopyranomorpholine analogues as selective dopamine D3 receptor ligands as anti-drug addiction therapeutic agents. Bioorg Med Chem Lett 48:0 (2021)  
Target
Name:
D(3) dopamine receptor
Synonyms:
DRD3 Dopamine D3 receptor
Type:
PROTEIN
Mol. Mass.:
44213.40
Organism:
Homo sapiens
Description:
ChEMBL_105671
Residue:
400
  
Inhibitor
Name:
BDBM50010586
Synonyms:
(+)-1-Propyl-2,3,10,10a-tetrahydro-1H,4aH-4,9-dioxa-1-aza-phenanthren-6-ol (4aR,10aR)-1-Propyl-2,3,10,10a-tetrahydro-1H,4aH-4,9-dioxa-1-aza-phenanthren-6-ol (trans)1-Propyl-2,3,10,10a-tetrahydro-1H,4aH-4,9-dioxa-1-aza-phenanthren-6-ol (PD 128907) CHEMBL70565 | PD 128,907
Type:
Small organic molecule
Emp. Form.:
C14H19NO3
Mol. Mass.:
249.3056
SMILES:
CCCN1CCO[C@H]2[C@H]1COc1ccc(O)cc21
: