Target
RNA-directed RNA polymerase
Ligand
BDBM50137486
Substrate
Meas. Tech.
ChEBML_143777
IC50
58000±n/a nM
Citation
 Beaulieu, PLBös, MBousquet, YFazal, GGauthier, JGillard, JGoulet, SLaPlante, SPoupart, MALefebvre, SMcKercher, GPellerin, CAustel, VKukolj, G Non-nucleoside inhibitors of the hepatitis C virus NS5B polymerase: discovery and preliminary SAR of benzimidazole derivatives. Bioorg Med Chem Lett 14:119-24 (2003)  
Target
Name:
RNA-directed RNA polymerase
Synonyms:
Hepatitis C virus NS5B RNA-dependent RNA polymerase | NS5B protein
Type:
Protein
Mol. Mass.:
25173.95
Organism:
Hepatitis C virus
Description:
Q8JXU8
Residue:
229
  
Inhibitor
Name:
BDBM50137486
Synonyms:
2-Benzofuran-2-yl-1-cyclohexyl-1H-benzoimidazole-5-carboxylic acid | CHEMBL176038
Type:
Small organic molecule
Emp. Form.:
C22H20N2O3
Mol. Mass.:
360.4058
SMILES:
OC(=O)c1ccc2n(C3CCCCC3)c(nc2c1)-c1cc2ccccc2o1
: