Target
Ephrin type-A receptor 4
Ligand
BDBM50572059
Substrate
Meas. Tech.
ChEMBL_2116084 (CHEMBL4825025)
Kd
94±n/a nM
Citation
 Baggio, CKulinich, ADennys, CNRodrigo, RMeyer, KEthell, IPellecchia, M NMR-Guided Design of Potent and Selective EphA4 Agonistic Ligands. J Med Chem 64:11229-11246 (2021)  
Target
Name:
Ephrin type-A receptor 4
Synonyms:
EPHA4 Ephrin receptor HEK8 TYRO1
Type:
PROTEIN
Mol. Mass.:
109859.29
Organism:
Homo sapiens (Human)
Description:
ChEMBL_586961
Residue:
986
  
Inhibitor
Name:
BDBM50572059
Synonyms:
CHEMBL4846015
Type:
Small organic molecule
Emp. Form.:
C49H61N11O7
Mol. Mass.:
916.0781
SMILES:
NCCCC(=O)N[C@@H](Cc1c[nH]c2ccc(O)cc12)C(=O)N[C@@H](Cc1ccc(cc1)-c1ccccc1)C(=O)N[C@@H](CCCCNC(N)=N)C(=O)NCC(=O)Nc1ccc(cc1)N1CCOCC1
: