Target
5-hydroxytryptamine receptor 1F
Ligand
BDBM50130461
Substrate
Meas. Tech.
ChEBML_2086
Ki
1.6±n/a nM
Citation
 Mathes, BMHudziak, KJSchaus, JMXu, YCNelson, DLWainscott, DBNutter, SEGough, WHBranchek, TAZgombick, JMFilla, SA Substituted furo[3,2-b]pyridines: novel bioisosteres of 5-HT 1F receptor agonists. Bioorg Med Chem Lett 14:167-70 (2003)  
Target
Name:
5-hydroxytryptamine receptor 1F
Synonyms:
5-HT-1F 5-hydroxytryptamine receptor 1F HTR1EL Serotonin (5-HT) receptor Serotonin receptor 1F
Type:
Enzyme Catalytic Domain
Mol. Mass.:
41724.68
Organism:
Homo sapiens (Human)
Description:
5-HT1F HTR1F HUMAN::P30939
Residue:
366
  
Inhibitor
Name:
BDBM50130461
Synonyms:
4-Fluoro-N-[3-(1-methyl-4-piperidinyl)-1H-indol-5-yl]benzamide CHEMBL101690 | LY-334370
Type:
Small organic molecule
Emp. Form.:
C21H22FN3O
Mol. Mass.:
351.4173
SMILES:
CN1CCC(CC1)c1c[nH]c2ccc(NC(=O)c3ccc(F)cc3)cc12
: