Target
Genome polyprotein
Ligand
BDBM50137961
Substrate
Meas. Tech.
ChEBML_143470
IC50
8000±n/a nM
Citation
 Goudreau, NCameron, DRBonneau, PGorys, VPlouffe, CPoirier, MLamarre, DLlinas-Brunet, M NMR structural characterization of peptide inhibitors bound to the Hepatitis C virus NS3 protease: design of a new P2 substituent. J Med Chem 47:123-32 (2003)  
Target
Name:
Genome polyprotein
Synonyms:
Hepatitis C virus NS3 protease/helicase | Hepatitis C virus serine protease, NS3/NS4A
Type:
Protein
Mol. Mass.:
67067.41
Organism:
Hepatitis C virus
Description:
A3EZI9
Residue:
631
  
Inhibitor
Name:
BDBM50137961
Synonyms:
1-{[(R)-(S)-1-[(S)-2-((S)-2-Acetylamino-2-cyclohexyl-acetylamino)-3-methyl-butyryl]-4-(7-trifluoromethyl-quinolin-4-yloxy)-pyrrolidine-2-carbonyl]-amino}-cyclopropanecarboxylic acid | CHEMBL369239
Type:
Small organic molecule
Emp. Form.:
C34H42F3N5O7
Mol. Mass.:
689.7218
SMILES:
CC(C)[C@H](NC(=O)[C@@H](NC(C)=O)C1CCCCC1)C(=O)N1C[C@@H](C[C@H]1C(=O)NC1(CC1)C(O)=O)Oc1ccnc2cc(ccc12)C(F)(F)F
: