Target
Mu-type opioid receptor
Ligand
BDBM50137999
Substrate
Meas. Tech.
ChEMBL_145149 (CHEMBL755953)
Ki
20±n/a nM
Citation
 Zhang, AXiong, WBidlack, JMHilbert, JEKnapp, BIWentland, MPNeumeyer, JL 10-Ketomorphinan and 3-substituted-3-desoxymorphinan analogues as mixed kappa and micro opioid ligands: synthesis and biological evaluation of their binding affinity at opioid receptors. J Med Chem 47:165-74 (2003)  
Target
Name:
Mu-type opioid receptor
Synonyms:
M-OR-1 Mu opioid receptor OPIATE Mu OPRM_CAVPO
Type:
Enzyme Catalytic Domain
Mol. Mass.:
11165.58
Organism:
GUINEA PIG
Description:
P97266
Residue:
98
  
Inhibitor
Name:
BDBM50137999
Synonyms:
3-Cyano-N-methylmorphinan | CHEMBL296304
Type:
Small organic molecule
Emp. Form.:
C18H22N2
Mol. Mass.:
266.3807
SMILES:
CN1CC[C@]23CCCC[C@H]2[C@H]1Cc1ccc(cc31)C#N
: