Target
Tryptase beta-2/delta/gamma
Ligand
BDBM50138157
Substrate
Meas. Tech.
ChEMBL_210689 (CHEMBL817287)
IC50
38±n/a nM
Citation
 Zhao, GBolton, SAKwon, CHartl, KSSeiler, SMSlusarchyk, WASutton, JCBisacchi, GS Synthesis of potent and selective 2-azepanone inhibitors of human tryptase. Bioorg Med Chem Lett 14:309-12 (2003)  
Target
Name:
Tryptase beta-2/delta/gamma
Synonyms:
Tryptase
Type:
Mol. Mass.:
Description:
ASSAY_ID of ChEMBL is 1510505
Components:
This complex has 3 components.
Component 1
Name:
Tryptase gamma
Synonyms:
PRSS31 TMT TRYG1_HUMAN Tryptase Tryptase gamma heavy chain | Tryptase gamma light chain
Type:
PROTEIN
Mol. Mass.:
33817.52
Organism:
Homo sapiens (Human)
Description:
ChEMBL_210833
Residue:
321
  
Component 2
Name:
Tryptase beta-2
Synonyms:
TPS2 TRYB2_HUMAN Tryptase II Tryptase-2
Type:
PROTEIN
Mol. Mass.:
30518.79
Organism:
Homo sapiens (Human)
Description:
ChEMBL_210702
Residue:
275
  
Component 3
Name:
Tryptase delta
Synonyms:
Delta-tryptase Mast cell mMCP-7-like TRYD_HUMAN Tryptase-3
Type:
PROTEIN
Mol. Mass.:
26578.73
Organism:
Homo sapiens (Human)
Description:
ChEMBL_104777
Residue:
242
  
Inhibitor
Name:
BDBM50138157
Synonyms:
Biphenyl-4-carboxylic acid {1-[(5-aminomethyl-2-chloro-phenylcarbamoyl)-methyl]-2-oxo-azepan-3-yl}-amide | CHEMBL323783
Type:
Small organic molecule
Emp. Form.:
C28H29ClN4O3
Mol. Mass.:
505.008
SMILES:
NCc1ccc(Cl)c(NC(=O)CN2CCCCC(NC(=O)c3ccc(cc3)-c3ccccc3)C2=O)c1
: