Target
Histone-lysine N-methyltransferase NSD2
Ligand
BDBM50572749
Substrate
Meas. Tech.
ChEMBL_2118106 (CHEMBL4827172)
IC50
3100±n/a nM
Citation
 Wang, SYang, HSu, MLian, FCong, ZWei, RZhou, YLi, XZheng, XLi, CFu, XHan, XShi, QLi, CZhang, NGeng, MLiu, HLi, JHuang, XWang, J 5-Aminonaphthalene derivatives as selective nonnucleoside nuclear receptor binding SET domain-protein 2 (NSD2) inhibitors for the treatment of multiple myeloma. Eur J Med Chem 222:0 (2021)  
Target
Name:
Histone-lysine N-methyltransferase NSD2
Synonyms:
KIAA1090 NSD2 Nuclear SET domain-containing protein 2 (NSD2) WHSC1
Type:
Protein
Mol. Mass.:
152327.31
Organism:
Homo sapiens (Human)
Description:
O96028
Residue:
1365
  
Inhibitor
Name:
BDBM50572749
Synonyms:
CHEMBL4854710
Type:
Small organic molecule
Emp. Form.:
C17H17ClN2O2S
Mol. Mass.:
348.847
SMILES:
Cl.Nc1cccc2c(cccc12)S(=O)(=O)NCc1ccccc1
: