Target
Histone-lysine N-methyltransferase EZH2
Ligand
BDBM50572749
Substrate
Meas. Tech.
ChEMBL_2118109 (CHEMBL4827175)
IC50
>20000±n/a nM
Citation
 Wang, SYang, HSu, MLian, FCong, ZWei, RZhou, YLi, XZheng, XLi, CFu, XHan, XShi, QLi, CZhang, NGeng, MLiu, HLi, JHuang, XWang, J 5-Aminonaphthalene derivatives as selective nonnucleoside nuclear receptor binding SET domain-protein 2 (NSD2) inhibitors for the treatment of multiple myeloma. Eur J Med Chem 222:0 (2021)  
Target
Name:
Histone-lysine N-methyltransferase EZH2
Synonyms:
ENX-1 EZH2_HUMAN Histone-lysine N-methyltransferase EZH2 Lysine N-methyltransferase 6
Type:
Protein
Mol. Mass.:
85367.84
Organism:
Homo sapiens (Human)
Description:
Q15910
Residue:
746
  
Inhibitor
Name:
BDBM50572749
Synonyms:
CHEMBL4854710
Type:
Small organic molecule
Emp. Form.:
C17H17ClN2O2S
Mol. Mass.:
348.847
SMILES:
Cl.Nc1cccc2c(cccc12)S(=O)(=O)NCc1ccccc1
: