Target
Histone-lysine N-methyltransferase 2A
Ligand
BDBM50572749
Substrate
Meas. Tech.
ChEMBL_2118110 (CHEMBL4827176)
IC50
>20000±n/a nM
Citation
 Wang, SYang, HSu, MLian, FCong, ZWei, RZhou, YLi, XZheng, XLi, CFu, XHan, XShi, QLi, CZhang, NGeng, MLiu, HLi, JHuang, XWang, J 5-Aminonaphthalene derivatives as selective nonnucleoside nuclear receptor binding SET domain-protein 2 (NSD2) inhibitors for the treatment of multiple myeloma. Eur J Med Chem 222:0 (2021)  
Target
Name:
Histone-lysine N-methyltransferase 2A
Synonyms:
ALL-1 ALL1 CXXC-type zinc finger protein 7 HRX Histone-lysine N-methyltransferase 2A KMT2A_HUMAN MLL MLL cleavage product N320 Myeloid/lymphoid or mixed-lineage leukemia Myeloid/lymphoid or mixed-lineage leukemia protein 1 TRX1 Zinc finger protein HRX p320
Type:
Protein
Mol. Mass.:
431905.67
Organism:
Homo sapiens (Human)
Description:
Q03164
Residue:
3969
  
Inhibitor
Name:
BDBM50572749
Synonyms:
CHEMBL4854710
Type:
Small organic molecule
Emp. Form.:
C17H17ClN2O2S
Mol. Mass.:
348.847
SMILES:
Cl.Nc1cccc2c(cccc12)S(=O)(=O)NCc1ccccc1
: