Target
Plasma kallikrein
Ligand
BDBM50138663
Substrate
Meas. Tech.
ChEMBL_92235 (CHEMBL703580)
Ki
22500±n/a nM
Citation
 Wendt, MDRockway, TWGeyer, AMcClellan, WWeitzberg, MZhao, XMantei, RNienaber, VLStewart, KKlinghofer, VGiranda, VL Identification of novel binding interactions in the development of potent, selective 2-naphthamidine inhibitors of urokinase. Synthesis, structural analysis, and SAR of N-phenyl amide 6-substitution. J Med Chem 47:303-24 (2004)  
Target
Name:
Plasma kallikrein
Synonyms:
Fletcher factor KLKB1 Kallikrein Plasma kallikrein heavy chain Plasma prekallikrein
Type:
Protein
Mol. Mass.:
71391.16
Organism:
Homo sapiens (Human)
Description:
P03952
Residue:
638
  
Inhibitor
Name:
BDBM50138663
Synonyms:
2-naphthimidamide Naphthalene-2-carboxamidine uPa_6
Type:
Small organic molecule
Emp. Form.:
C11H10N2
Mol. Mass.:
170.2105
SMILES:
NC(=N)c1ccc2ccccc2c1
: