Target
Urokinase-type plasminogen activator
Ligand
BDBM50138663
Substrate
Meas. Tech.
ChEMBL_213154 (CHEMBL815981)
Ki
5910±n/a nM
Citation
 Wendt, MDRockway, TWGeyer, AMcClellan, WWeitzberg, MZhao, XMantei, RNienaber, VLStewart, KKlinghofer, VGiranda, VL Identification of novel binding interactions in the development of potent, selective 2-naphthamidine inhibitors of urokinase. Synthesis, structural analysis, and SAR of N-phenyl amide 6-substitution. J Med Chem 47:303-24 (2004)  
Target
Name:
Urokinase-type plasminogen activator
Synonyms:
3.4.21.73 U-plasminogen activator Urokinase Urokinase-type plasminogen activator chain B Urokinase-type plasminogen activator short chain A uPA
Type:
Enzyme
Mol. Mass.:
48528.62
Organism:
Homo sapiens (Human)
Description:
P00749
Residue:
431
  
Inhibitor
Name:
BDBM50138663
Synonyms:
2-naphthimidamide Naphthalene-2-carboxamidine uPa_6
Type:
Small organic molecule
Emp. Form.:
C11H10N2
Mol. Mass.:
170.2105
SMILES:
NC(=N)c1ccc2ccccc2c1
: