Target
Tissue-type plasminogen activator
Ligand
BDBM50138663
Substrate
Meas. Tech.
ChEMBL_208066 (CHEMBL814417)
Ki
>100000±n/a nM
Citation
 Wendt, MDRockway, TWGeyer, AMcClellan, WWeitzberg, MZhao, XMantei, RNienaber, VLStewart, KKlinghofer, VGiranda, VL Identification of novel binding interactions in the development of potent, selective 2-naphthamidine inhibitors of urokinase. Synthesis, structural analysis, and SAR of N-phenyl amide 6-substitution. J Med Chem 47:303-24 (2004)  
Target
Name:
Tissue-type plasminogen activator
Synonyms:
Alteplase Reteplase Thrombin receptor protein Tissue-type plasminogen activator (tPA) t-PA t-plasminogen activator
Type:
Enzyme
Mol. Mass.:
62931.08
Organism:
Homo sapiens (Human)
Description:
Residue:
562
  
Inhibitor
Name:
BDBM50138663
Synonyms:
2-naphthimidamide Naphthalene-2-carboxamidine uPa_6
Type:
Small organic molecule
Emp. Form.:
C11H10N2
Mol. Mass.:
170.2105
SMILES:
NC(=N)c1ccc2ccccc2c1
: