Target
5'-3' exonuclease PLD3
Ligand
BDBM50572961
Substrate
Meas. Tech.
ChEMBL_2118712 (CHEMBL4827778)
IC50
13000±n/a nM
Citation
 Shirey, RJTurner, LDLairson, LLJanda, KD Modulators of immunoregulatory exonucleases PLD3 and PLD4 identified by high-throughput screen. Bioorg Med Chem Lett 49:0 (2021)  
Target
Name:
5'-3' exonuclease PLD3
Synonyms:
3.1.16.1 Choline phosphatase 3 Hu-K4 PLD3 Phosphatidylcholine-hydrolyzing phospholipase D3 | Phospholipase D3
Type:
PROTEIN
Mol. Mass.:
54704.21
Organism:
Homo sapiens
Description:
ChEMBL_12540
Residue:
490
  
Inhibitor
Name:
BDBM50572961
Synonyms:
CHEMBL4870571
Type:
Small organic molecule
Emp. Form.:
C17H18N4O4S
Mol. Mass.:
374.414
SMILES:
Cc1ccc(Cn2c(SCC(O)=O)nc3n(C)c(=O)n(C)c(=O)c23)cc1
: