Target
Cannabinoid receptor 1
Ligand
BDBM50573093
Substrate
Meas. Tech.
ChEMBL_2118937 (CHEMBL4828003)
EC50
0.040000±n/a nM
Citation
 Abdel-Magid, AF Cannabinoid Receptor Agonists for the Potential Treatment of Pain, Neurological Disorders, Fibrotic Diseases, Obesity, and Many More. ACS Med Chem Lett 12:1188-1190 (2021)  
Target
Name:
Cannabinoid receptor 1
Synonyms:
CANN6 CB-R CNR CNR1_HUMAN Cannabinoid receptor Cannabinoid receptor 1 (brain)
Type:
G Protein-Coupled Receptor (GPCR)
Mol. Mass.:
52868.96
Organism:
Homo sapiens (Human)
Description:
P21554
Residue:
472
  
Inhibitor
Name:
BDBM50573093
Synonyms:
CHEMBL4875720
Type:
Small organic molecule
Emp. Form.:
C19H22N6O2
Mol. Mass.:
366.417
SMILES:
CCC(C)(C)c1noc(n1)-c1nn(c2C3CCC(Cc12)O3)-c1cnccn1
: