Target
5-hydroxytryptamine receptor 7
Ligand
BDBM50573252
Substrate
Meas. Tech.
ChEMBL_2119282 (CHEMBL4828348)
Ki
72±n/a nM
Citation
 Kwag, RLee, JKim, DLee, HYeom, MWoo, JCho, YKim, HJKim, JKeum, GJeon, BChoo, H Discovery of G Protein-Biased Antagonists against 5-HT J Med Chem 64:13766-13779 (2021)  
Target
Name:
5-hydroxytryptamine receptor 7
Synonyms:
5-HT-7 5-HT7 5-HT7S 5HT7 HTR7 | Serotonin receptor 7
Type:
G Protein-Coupled Receptor (GPCR)
Mol. Mass.:
53573.08
Organism:
Homo sapiens (Human)
Description:
P34969
Residue:
479
  
Inhibitor
Name:
BDBM50573252
Synonyms:
CHEMBL4871980
Type:
Small organic molecule
Emp. Form.:
C13H15FN4
Mol. Mass.:
246.2834
SMILES:
Fc1ccc(cc1)-c1n[nH]cc1N1CCNCC1
: