Target
5-hydroxytryptamine receptor 2B
Ligand
BDBM50573235
Substrate
Meas. Tech.
ChEMBL_2119293 (CHEMBL4828359)
Ki
416±n/a nM
Citation
 Kwag, RLee, JKim, DLee, HYeom, MWoo, JCho, YKim, HJKim, JKeum, GJeon, BChoo, H Discovery of G Protein-Biased Antagonists against 5-HT J Med Chem 64:13766-13779 (2021)  
Target
Name:
5-hydroxytryptamine receptor 2B
Synonyms:
5-HT-2B 5-hydroxytryptamine (serotonin) receptor 2B [Homo sapiens] 5-hydroxytryptamine receptor 2C (5HT2C) HTR2B Serotonin 2b (5-HT2b) receptor | Serotonin Receptor 2B
Type:
G Protein-Coupled Receptor (GPCR)
Mol. Mass.:
54312.47
Organism:
Homo sapiens (Human)
Description:
Receptor binding assays were performed using human clone stably expressed in CHO cells.
Residue:
481
  
Inhibitor
Name:
BDBM50573235
Synonyms:
CHEMBL4877603
Type:
Small organic molecule
Emp. Form.:
C14H17ClN4
Mol. Mass.:
276.765
SMILES:
Clc1cccc(c1)-c1n[nH]cc1N1CCCNCC1
: