Target
5-hydroxytryptamine receptor 6
Ligand
BDBM50573235
Substrate
Meas. Tech.
ChEMBL_2119298 (CHEMBL4828364)
Ki
529±n/a nM
Citation
 Kwag, RLee, JKim, DLee, HYeom, MWoo, JCho, YKim, HJKim, JKeum, GJeon, BChoo, H Discovery of G Protein-Biased Antagonists against 5-HT J Med Chem 64:13766-13779 (2021)  
Target
Name:
5-hydroxytryptamine receptor 6
Synonyms:
5-HT-6 5-hydroxytryptamine receptor 6 (5-HT-6) 5-hydroxytryptamine receptor 6 (5HT6) HTR6 Serotonin 6 (5-HT6) receptor | Serotonin Receptor 6
Type:
G Protein-Coupled Receptor (GPCR)
Mol. Mass.:
46968.43
Organism:
Homo sapiens (Human)
Description:
P50406
Residue:
440
  
Inhibitor
Name:
BDBM50573235
Synonyms:
CHEMBL4877603
Type:
Small organic molecule
Emp. Form.:
C14H17ClN4
Mol. Mass.:
276.765
SMILES:
Clc1cccc(c1)-c1n[nH]cc1N1CCCNCC1
: