Target
Cyclin-dependent kinase 8
Ligand
BDBM50573483
Substrate
Meas. Tech.
ChEMBL_2119599 (CHEMBL4828665)
IC50
2.0±n/a nM
Citation
 Hatcher, JMVatsan, PSWang, EJiang, JGray, NS Development of Highly Potent and Selective Pyrazolopyridine Inhibitor of CDK8/19. ACS Med Chem Lett 12:1689-1693 (2021)  
Target
Name:
Cyclin-dependent kinase 8
Synonyms:
CDK8 Cell division protein kinase 8 Mediator complex subunit CDK8 Protein kinase K35
Type:
Serine/threonine-protein kinase
Mol. Mass.:
53300.21
Organism:
Homo sapiens (Human)
Description:
P49336
Residue:
464
  
Inhibitor
Name:
BDBM50573483
Synonyms:
CHEMBL4877883
Type:
Small organic molecule
Emp. Form.:
C22H22ClN7O
Mol. Mass.:
435.909
SMILES:
Cn1ncc2cc(ccc12)-c1cnc2[nH]nc(Cl)c2c1N1CCC2(CCNC2=O)CC1
: