Target
Cyclin-dependent kinase 8
Ligand
BDBM50163795
Substrate
Meas. Tech.
ChEMBL_2119599 (CHEMBL4828665)
IC50
5.0±n/a nM
Citation
 Hatcher, JMVatsan, PSWang, EJiang, JGray, NS Development of Highly Potent and Selective Pyrazolopyridine Inhibitor of CDK8/19. ACS Med Chem Lett 12:1689-1693 (2021)  
Target
Name:
Cyclin-dependent kinase 8
Synonyms:
CDK8 Cell division protein kinase 8 Mediator complex subunit CDK8 Protein kinase K35
Type:
Serine/threonine-protein kinase
Mol. Mass.:
53300.21
Organism:
Homo sapiens (Human)
Description:
P49336
Residue:
464
  
Inhibitor
Name:
BDBM50163795
Synonyms:
CHEMBL3798382
Type:
Small organic molecule
Emp. Form.:
C21H23ClN6O
Mol. Mass.:
410.9
SMILES:
Cn1ncc2cc(ccc12)-c1cnc(N)c(Cl)c1N1CCC2(CCNC2=O)CC1
: