Target
Melanocortin receptor 4
Ligand
BDBM50574246
Substrate
Meas. Tech.
ChEMBL_2122104 (CHEMBL4831251)
EC50
>100000±n/a nM
Citation
 Ericson, MDDoering, SRLarson, CMFreeman, KTLaVoi, TMDonow, HMSantos, RGCho, RHKoerperich, ZMGiulianotti, MAPinilla, CHoughten, RAHaskell-Luevano, C Functional Mixture-Based Positional Scan Identifies a Library of Antagonist Tetrapeptide Sequences (LAtTeS) with Nanomolar Potency for the Melanocortin-4 Receptor and Equipotent with the Endogenous AGRP(86-132) Antagonist. J Med Chem 64:14860-14875 (2021)  
Target
Name:
Melanocortin receptor 4
Synonyms:
MC4-R Mc4r
Type:
PROTEIN
Mol. Mass.:
36964.43
Organism:
Mus musculus
Description:
ChEMBL_1498850
Residue:
332
  
Inhibitor
Name:
BDBM50574246
Synonyms:
CHEMBL4852297
Type:
Small organic molecule
Emp. Form.:
C34H47IN12O5
Mol. Mass.:
830.7188
SMILES:
CC(=O)N[C@H](Cc1ccc(I)cc1)C(=O)N[C@@H](CCCNC(N)=N)C(=O)N[C@@H](Cc1c[nH]c2ccccc12)C(=O)N[C@@H](CCCNC(N)=N)C(N)=O
: