Target
Glutamate receptor ionotropic, NMDA 1/2B
Ligand
BDBM50140325
Substrate
Meas. Tech.
ChEMBL_143322 (CHEMBL750405)
IC50
31±n/a nM
Citation
 Kornberg, BENikam, SSWright, JLKesten, SRMeltzer, LTCoughenour, LBarr, BSerpa, KAMcCormick, J Subtype selective NMDA receptor antagonists: evaluation of some novel alkynyl analogues. Bioorg Med Chem Lett 14:1213-6 (2004)  
Target
Name:
Glutamate receptor ionotropic, NMDA 1/2B
Synonyms:
Glutamate NMDA receptor; Grin1/Grin2b | Glutamate [NMDA] receptor subunit epsilon 2/zeta 1
Type:
Mol. Mass.:
Description:
ASSAY_ID of EBI is 141026
Components:
This complex has 2 components.
Component 1
Name:
Glutamate receptor ionotropic, NMDA 2B
Synonyms:
GluN2B Grin2b NMDA receptor subunit N2B (GluN2B) NMDE2_RAT | NR2B
Type:
Protein
Mol. Mass.:
166077.66
Organism:
Rattus norvegicus (Rat)
Description:
Q00960
Residue:
1482
  
Component 2
Name:
Glutamate receptor ionotropic, NMDA 1
Synonyms:
Glutamate (NMDA) receptor subunit zeta 1 Glutamate-NMDA-Channel Glutamate-NMDA-Polyamine NMDA Nmdar1 | phencyclidine
Type:
Enzyme Catalytic Domain
Mol. Mass.:
105533.40
Organism:
RAT
Description:
P35439
Residue:
938
  
Inhibitor
Name:
BDBM50140325
Synonyms:
6-{3-[4-(4-Fluoro-benzyl)-piperidin-1-yl]-prop-1-ynyl}-4,5-dimethyl-1,3-dihydro-benzoimidazol-2-one | CHEMBL280882
Type:
Small organic molecule
Emp. Form.:
C24H26FN3O
Mol. Mass.:
391.4811
SMILES:
Cc1c(C)c2[nH]c(=O)[nH]c2cc1C#CCN1CCC(Cc2ccc(F)cc2)CC1
: