Target
Cholinesterase
Ligand
BDBM50318484
Substrate
Meas. Tech.
ChEMBL_2123408 (CHEMBL4832641)
IC50
670±n/a nM
Citation
 Jiang, XZhang, ZZuo, JWu, CZha, LXu, YWang, SShi, JLiu, XHZhang, JTang, W Novel cannabidiol-carbamate hybrids as selective BuChE inhibitors: Docking-based fragment reassembly for the development of potential therapeutic agents against Alzheimer's disease. Eur J Med Chem 223:0 (2021)  
Target
Name:
Cholinesterase
Synonyms:
BCHE CHLE_HORSE | Cholinesterase
Type:
Enzyme
Mol. Mass.:
65643.35
Organism:
Equus caballus (Horse)
Description:
P81908
Residue:
574
  
Inhibitor
Name:
BDBM50318484
Synonyms:
2-((1R,6R)-6-Isopropenyl-3-methyl-cyclohex-2-enyl)-5-pentyl-benzene-1,3-diol CHEMBL190461
Type:
Small organic molecule
Emp. Form.:
C21H30O2
Mol. Mass.:
314.4617
SMILES:
CCCCCc1cc(O)c([C@@H]2C=C(C)CC[C@H]2C(C)=C)c(O)c1
: